Peptide,PTM,ModifiedAA,ModifiedPosition,PeptideUniqueToGene,ExperimentDesc,ExpID,PubmedID,ScoreType,IdentScore,LocProb,Log2FChange,PQ-val,QuantSig,PEP,MassErrorPPM
SQQQFNAGQNR,ph,S,2,true,"Tissue atlas Arabidopsis - ProteomicsDB",114,32188942,"MaxQuant score",184.3600000,1.0000000,,,,7.8259203587991E-15,
AEQWTESAK,ph,T,23,true,"Tissue atlas Arabidopsis - ProteomicsDB",114,32188942,"MaxQuant score",137.8900000,0.9982280,,,,0.00014699700113852,
AEQWTESAKQTAQSACDK,ph,S,25,true,"Tissue atlas Arabidopsis - ProteomicsDB",114,32188942,"MaxQuant score",275.7600000,0.9999990,,,,0,
AEQWTESAK,ph,S,25,true,"Pollen phosphoproteome Arabidopsis",43,22631563,"MASCOT Score",45.3500000,,,,,,-2.7744200
AEQWTESAKQTAQSACDK,ph,T,29,true,"Tissue atlas Arabidopsis - ProteomicsDB",114,32188942,"MaxQuant score",58.9300000,0.9787530,,,,0.0047310101799667,
QTAQSACDKTADLTQSAR,ph,S,32,true,"Tissue atlas Arabidopsis - ProteomicsDB",114,32188942,"MaxQuant score",146.6700000,0.9999930,,,,7.1884000316663E-17,
QTAQSACDKTADLTQSAR,cr,K,36,true,"Open search Plant PTM Viewer 2.0 - Crotonylation",164c,TBA,,,,,,,,
QTAQSACDKTADLTQSAR,ph,T,37,true,"Pollen phosphoproteome Arabidopsis",43,22631563,"MASCOT Score",53.2900000,,,,,,
QTAQSACDKTADLTQSAR,ph,T,37,true,"Tissue atlas Arabidopsis - ProteomicsDB",114,32188942,"MaxQuant score",233.5400000,1.0000000,,,,0,
TADLTQSAR,ph,T,41,true,"Tissue atlas Arabidopsis - ProteomicsDB",114,32188942,"MaxQuant score",138.7100000,0.9997260,,,,0.00025083200307563,
TADLTQSAR,ph,S,43,true,"Pollen phosphoproteome Arabidopsis",43,22631563,"MASCOT Score",78.2200000,,,,,,
TADLTQSAR,ph,S,43,true,"Protein sumoylation and phosphorylation cross-talk",97,28419593,,,,,,,,
TADLTQSAR,ph,S,43,true,"Tissue atlas Arabidopsis - ProteomicsDB",114,32188942,"MaxQuant score",222.1800000,1.0000000,,,,1.7586500567259E-23,
DKAADLTQSAR,ub,K,47,true,"Arabidopsis ubiquitination COFRADIC",40,26744219,"MaxQuant Score",42.9760000,1.0000000,,,,0.0049999998882413,-0.8560000
AADLTQSAR,ph,T,52,true,"Tissue atlas Arabidopsis - ProteomicsDB",114,32188942,"MaxQuant score",178.2300000,0.9999490,,,,3.2080599027956E-13,
AADLTQSAR,ph,S,54,true,"Protein sumoylation and phosphorylation cross-talk",97,28419593,,,,,,,,
AADLTQSAR,ph,S,54,true,"Tissue atlas Arabidopsis - ProteomicsDB",114,32188942,"MaxQuant score",218.0700000,1.0000000,,,,4.3558100307813E-23,
TADGSHSANKSAQHNQEQAAGLFGQTGESVK,ph,S,63,true,"Tissue atlas Arabidopsis - ProteomicsDB",114,32188942,"MaxQuant score",204.1100000,0.8246910,,,,0,
TADGSHSANKSAQHNQEQAAGLFGQTGESVK,ph,S,65,true,"Tissue atlas Arabidopsis - ProteomicsDB",114,32188942,"MaxQuant score",204.1100000,0.9471500,,,,0,
SAQHNQEQAAGLFGQTGESVK,ph,S,69,true,"Tissue atlas Arabidopsis - ProteomicsDB",114,32188942,"MaxQuant score",430.6600000,1.0000000,,,,0,
SAQHNQEQAAGLFGQTGESVK,ph,T,84,true,"Tissue atlas Arabidopsis - ProteomicsDB",114,32188942,"MaxQuant score",156.4700000,0.9975910,,,,4.4951701430812E-29,
SAQHNQEQAAGLFGQTGESVK,ph,S,87,true,"Tissue atlas Arabidopsis - ProteomicsDB",114,32188942,"MaxQuant score",402.3200000,0.9999990,,,,0,
NMAQGALDGVKNSLGMNEK,ph,S,102,true,"Tissue atlas Arabidopsis - ProteomicsDB",114,32188942,"MaxQuant score",425.5400000,1.0000000,,,,0,
