Peptide,PTM,ModifiedAA,ModifiedPosition,PeptideUniqueToGene,ExperimentDesc,ExpID,PubmedID,ScoreType,IdentScore,LocProb,Log2FChange,PQ-val,QuantSig,PEP,MassErrorPPM
SNCLQLNTSCVGCGSQSDLYGSSCR,nta,S,2,true,"HUNTER N-terminome: legumain, GluC and trypsin",119,31951383,"MaxQuant score",74.8760000,,,,,,
SSGGDEEEGNVSDRGDEDEEEEASRK,ph,S,237,true,"STN8 phosphoproteome",38,21768351,"MASCOT Score",90.5800000,,,,,,-1.4584500
SSGGDEEEGNVSDRGDEDEEEEASRK,ph,S,237,true,"srk2dei ABA signaling phopshoproteomics",83,23572148,"MASCOT Score",93.0000000,,,,,,-0.0013000
SSGGDEEEGNVSDRGDEDEEEEASRK,ph,S,237,true,"LAXIC - mannitol vs control",84b,23660473,XCorr,3.3900000,0.9800000,-2.2830231,,NO,0.0022265301086009,
SSGGDEEEGNVSDRGDEDEEEEASRK,ph,S,237,true,"SnRK2 protein kinase substrates",85,23776212,XCorr,3.0333204,0.9960000,,,,5.9803703322814E-8,
SSGGDEEEGNVSDRGDEDEEEEASRK,ph,S,237,true,"Brassinosteroid-Regulated Phosphorylation Dynamics",94,26187819,"MaxQuant Score",123.6200000,1.0000000,,,,3.5340000782529E-13,0.8910000
SSGGDEEEGNVSDRGDEDEEEEASRK,ph,S,237,true,"TOR Kinase and ABA Receptor",100,29290610,XCorr,4.0373163,1.0000000,,,,0.0020109999459237,
SSGGDEEEGNVSDRGDEDEEEEASR,ph,S,237,true,"LAXIC - ABA stress",84a,23660473,XCorr,3.9200000,0.8790000,,,,0.00069652497768402,
SSGGDEEEGNVSDRGDEDEEEEASR,ph,S,237,true,"LAXIC - mannitol vs control",84b,23660473,XCorr,3.9600000,0.9970000,-1.5236706,,NO,1.0499999985149E-13,
SSGGDEEEGNVSDRGDEDEEEEASR,ph,S,237,true,"SnRK2 protein kinase substrates",85,23776212,XCorr,4.0294652,1.0000000,,,,0.0012999100144953,
SSGGDEEEGNVSDRGDEDEEEEASR,ph,S,237,true,"atm and atr DNA damage response",88,25561503,"MASCOT Score",42.0000000,1.0000000,,,,,-0.1000000
SSGGDEEEGNVSDRGDEDEEEEASR,ph,S,237,true,"Col-0 callus - FC Col-0 vs. Col-0 Xray",111a,31410901,,59.5600000,,1.0243997,0.0000000,NO,,0.7078856
SSGGDEEEGNVSDRGDEDEEEEASR,ph,S,237,true,"Col-0 X-ray callus - FC Col-0 vs. Col-0 Xray",111b,31410901,,59.5600000,,1.0243997,0.0000000,NO,,0.7078856
SSGGDEEEGNVSDRGDEDEEEEASR,ph,S,237,true,"atm callus - FC atm vs. atm Xray",111c,31410901,,59.5600000,,-1.2593800,0.0000000,NO,,0.7078856
SSGGDEEEGNVSDRGDEDEEEEASR,ph,S,237,true,"atm-3 X-ray callus - FC atm vs. atm Xray",111d,31410901,,59.5600000,,-1.2593800,0.0000000,NO,,0.7078856
SSGGDEEEGNVSDR,ph,S,237,true,"Tissue atlas Arabidopsis - ProteomicsDB",114,32188942,"MaxQuant score",309.1500000,1.0000000,,,,0,
KSNDDDDEEGPR,ph,S,260,true,"atm and atr DNA damage response",88,25561503,"MASCOT Score",51.0000000,1.0000000,,,,,-2.1600000
SNDDDDEEGPR,ph,S,260,true,"atm and atr DNA damage response",88,25561503,"MASCOT Score",51.0000000,1.0000000,,,,,-0.2300000
GDDWEHEEIFTDDDEAVGNDPEEREDLLAPEIPAPPEIK,ph,T,294,true,"TOR Kinase and ABA Receptor",100,29290610,XCorr,2.8691676,1.0000000,,,,0.014560000039637,
GGDLDMDDDDIEKGDDWEHEEIFTDDDEAVGNDPEER,ph,T,294,true,"SnRK2 protein kinase substrates",85,23776212,XCorr,3.2902880,1.0000000,,,,0.0054002702236176,
GDDWEHEEIFTDDDEAVGNDPEER,ph,T,294,true,"srk2dei ABA signaling phopshoproteomics",83,23572148,"MASCOT Score",38.0000000,,,,,,0.0006000
GDDWEHEEIFTDDDEAVGNDPEER,ph,T,294,true,"SnRK2 protein kinase substrates",85,23776212,XCorr,4.2822347,1.0000000,,,,4.028379851917E-9,
GDDWEHEEIFTDDDEAVGNDPEER,ph,T,294,true,"TOR Kinase and ABA Receptor",100,29290610,XCorr,4.1362495,1.0000000,,,,2.1320000087144E-5,
ANGLDESDEDDDDDSDDEEETNYGTVTNSK,ph,S,357,true,"srk2dei ABA signaling phopshoproteomics",83,23572148,"MASCOT Score",34.0000000,,,,,,-0.0028000
ANGLDESDEDDDDDSDDEEETNYGTVTNSK,ph,S,357,true,"SnRK2 protein kinase substrates",85,23776212,XCorr,5.6669068,1.0000000,,,,2.4752601227376E-13,
ANGLDESDEDDDDDSDDEEETNYGTVTNSK,ph,S,357,true,"TOR Kinase and ABA Receptor",100,29290610,XCorr,5.3098931,1.0000000,,,,2.0649999896705E-6,
ANGLDESDEDDDDDSDDEEETNYGTVTNSK,ph,S,357,true,"Col-0 callus - FC Col-0 vs. Col-0 Xray",111a,31410901,,54.5000000,,8.3321488,0.0000000,NO,,1.2319881
ANGLDESDEDDDDDSDDEEETNYGTVTNSK,ph,S,357,true,"Col-0 X-ray callus - FC Col-0 vs. Col-0 Xray",111b,31410901,,54.5000000,,8.3321488,0.0000000,NO,,1.2319881
ANGLDESDEDDDDDSDDEEETNYGTVTNSK,ph,S,357,true,"atm callus - FC atm vs. atm Xray",111c,31410901,,54.5000000,,-15.6027348,0.0000000,NO,,1.2319881
ANGLDESDEDDDDDSDDEEETNYGTVTNSK,ph,S,357,true,"atm-3 X-ray callus - FC atm vs. atm Xray",111d,31410901,,54.5000000,,-15.6027348,0.0000000,NO,,1.2319881
ANGLDESDEDDDDDSDDEEETNYGTVTNSK,ph,S,365,true,"srk2dei ABA signaling phopshoproteomics",83,23572148,"MASCOT Score",34.0000000,,,,,,-0.0028000
ANGLDESDEDDDDDSDDEEETNYGTVTNSK,ph,S,365,true,"SnRK2 protein kinase substrates",85,23776212,XCorr,5.6669068,1.0000000,,,,2.4752601227376E-13,
ANGLDESDEDDDDDSDDEEETNYGTVTNSK,ph,S,365,true,"TOR Kinase and ABA Receptor",100,29290610,XCorr,5.3098931,1.0000000,,,,2.0649999896705E-6,
ANGLDESDEDDDDDSDDEEETNYGTVTNSK,ph,S,365,true,"Col-0 callus - FC Col-0 vs. Col-0 Xray",111a,31410901,,54.5000000,,8.3321488,0.0000000,NO,,1.2319881
ANGLDESDEDDDDDSDDEEETNYGTVTNSK,ph,S,365,true,"Col-0 X-ray callus - FC Col-0 vs. Col-0 Xray",111b,31410901,,54.5000000,,8.3321488,0.0000000,NO,,1.2319881
ANGLDESDEDDDDDSDDEEETNYGTVTNSK,ph,S,365,true,"atm callus - FC atm vs. atm Xray",111c,31410901,,54.5000000,,-15.6027348,0.0000000,NO,,1.2319881
ANGLDESDEDDDDDSDDEEETNYGTVTNSK,ph,S,365,true,"atm-3 X-ray callus - FC atm vs. atm Xray",111d,31410901,,54.5000000,,-15.6027348,0.0000000,NO,,1.2319881
EAAKEEPVDNAPAKPAPSGPPR,ph,S,400,true,"Tissue atlas Arabidopsis - ProteomicsDB",114,32188942,"MaxQuant score",94.7300000,1.0000000,,,,3.8682199110518E-10,
GTPPAKPSK,ph,T,406,true,"atm and atr DNA damage response",88,25561503,"MASCOT Score",32.0000000,1.0000000,,,,,-3.5800000
AEPASAPASSSSAATGPVTEDEIR,ph,S,468,true,"Tissue atlas Arabidopsis - ProteomicsDB",114,32188942,"MaxQuant score",72.5320000,0.8403180,,,,3.2132899008275E-8,
AEPASAPASSSSAATGPVTEDEIR,ph,S,472,true,"Tissue atlas Arabidopsis - ProteomicsDB",114,32188942,"MaxQuant score",186.9000000,0.7736620,,,,0,
AEPASAPASSSSAATGPVTEDEIR,ph,S,473,true,"Tissue atlas Arabidopsis - ProteomicsDB",114,32188942,"MaxQuant score",192.2700000,0.8438460,,,,0,
NAGSQNFVVLR,ph,S,534,true,"Tissue atlas Arabidopsis - ProteomicsDB",114,32188942,"MaxQuant score",111.6300000,1.0000000,,,,3.2667099731043E-5,
