Peptide,PTM,ModifiedAA,ModifiedPosition,PeptideUniqueToGene,ExperimentDesc,ExpID,PubmedID,ScoreType,IdentScore,LocProb,Log2FChange,PQ-val,QuantSig,PEP,MassErrorPPM
GSDTVPDGSVPQNK,ph,S,944,true,"Tissue atlas Arabidopsis - ProteomicsDB",114,32188942,"MaxQuant score",131.3200000,0.9641210,,,,3.4291300835321E-5,
AEVNKSPVGSSTK,ph,S,1091,true,"Tissue atlas Arabidopsis - ProteomicsDB",114,32188942,"MaxQuant score",130.2700000,0.9999960,,,,5.602899909718E-5,
GQPSPNREDFNFLR,ph,S,1216,true,"srk2dei ABA signaling phopshoproteomics",83,23572148,"MASCOT Score",25.0000000,,,,,,-0.0003000
GQPSPNREDFNFLR,ph,S,1216,true,"atm and atr DNA damage response",88,25561503,"MASCOT Score",26.0000000,1.0000000,,,,,-0.1600000
GQPSPNREDFNFLR,ph,S,1216,true,"Tissue atlas Arabidopsis - ProteomicsDB",114,32188942,"MaxQuant score",89.8660000,1.0000000,,,,6.3727202359587E-5,
LGSSSSVSLDK,ph,S,1381,true,"atm and atr DNA damage response",88,25561503,"MASCOT Score",27.0000000,0.9870000,,,,,-2.2800000
LGSSSSVSLDK,ph,S,1381,true,"Tissue atlas Arabidopsis - ProteomicsDB",114,32188942,"MaxQuant score",71.9760000,0.9688300,,,,0.0023714399430901,
LGSSSSVSLDK,ph,S,1382,true,"Tissue atlas Arabidopsis - ProteomicsDB",114,32188942,"MaxQuant score",128.3600000,0.9742550,,,,8.0035197242978E-6,
LGSSSSVSLDK,ph,S,1383,true,"Tissue atlas Arabidopsis - ProteomicsDB",114,32188942,"MaxQuant score",196.0200000,0.9306050,,,,1.5535400059523E-18,
LGSSSSVSLDK,ph,S,1384,true,"srk2dei ABA signaling phopshoproteomics",83,23572148,"MASCOT Score",24.0000000,,,,,,0.0008000
LGSSSSVSLDK,ph,S,1384,true,"Tissue atlas Arabidopsis - ProteomicsDB",114,32188942,"MaxQuant score",208.9500000,0.9857270,,,,9.8022800981302E-25,
LGSSSSVSLDK,ph,S,1386,true,"srk2dei ABA signaling phopshoproteomics",83,23572148,"MASCOT Score",53.0000000,,,,,,-0.0001000
LGSSSSVSLDK,ph,S,1386,true,"atm and atr DNA damage response",88,25561503,"MASCOT Score",62.0000000,0.9950000,,,,,-0.7300000
LGSSSSVSLDK,ph,S,1386,true,"TOR Kinase and ABA Receptor",100,29290610,XCorr,3.0220706,0.9945000,,,,0.0001328999933321,
LGSSSSVSLDK,ph,S,1386,true,"Tissue atlas Arabidopsis - ProteomicsDB",114,32188942,"MaxQuant score",166.7700000,0.9819980,,,,2.0362300387489E-11,
RASFGATIENDPCIHAK,ph,S,1409,true,"Arabidopsis root NAA phosphoproteome",18a,27643528,"MaxQuant Score",56.4800000,0.9970000,,,,2.3040000087349E-5,0.1130000
RASFGATIENDPCIHAK,ph,S,1409,true,"PAMP-triggered phosphorylation",48,24601666,"MASCOT Score",37.6400000,,,,,,
RASFGATIENDPCIHAK,ph,S,1409,true,"Tyrosine phosphorylation in Arabidopsis",59,18463617,"MASCOT Score",33.0000000,,,,,,-0.9156229
RASFGATIENDPCIHAK,ph,S,1409,true,"srk2dei ABA signaling phopshoproteomics",83,23572148,"MASCOT Score",67.0000000,,,,,,0.0003000
RASFGATIENDPCIHAK,ph,S,1409,true,"LAXIC - ABA stress",84a,23660473,XCorr,3.5900000,0.9950000,,,,0.024534199386835,
RASFGATIENDPCIHAK,ph,S,1409,true,"LAXIC - mannitol vs control",84b,23660473,XCorr,4.2100000,1.0000000,,,,2.1599999566746E-11,
RASFGATIENDPCIHAK,ph,S,1409,true,"SnRK2 protein kinase substrates",85,23776212,XCorr,3.6796427,1.0000000,,,,0.0014171400107443,
RASFGATIENDPCIHAK,ph,S,1409,true,"atm and atr DNA damage response",88,25561503,"MASCOT Score",46.0000000,1.0000000,,,,,0.1200000
RASFGATIENDPCIHAK,ph,S,1409,true,"Col-0 callus - FC Col-0 vs. Col-0 Xray",111a,31410901,,54.0600000,,-0.5094903,0.0000000,NO,,0.6864350
RASFGATIENDPCIHAK,ph,S,1409,true,"Col-0 X-ray callus - FC Col-0 vs. Col-0 Xray",111b,31410901,,54.0600000,,-0.5094903,0.0000000,NO,,0.6864350
RASFGATIENDPCIHAK,ph,S,1409,true,"atm callus - FC atm vs. atm Xray",111c,31410901,,54.0600000,,-0.1719103,0.0000000,NO,,0.6864350
RASFGATIENDPCIHAK,ph,S,1409,true,"atm-3 X-ray callus - FC atm vs. atm Xray",111d,31410901,,54.0600000,,-0.1719103,0.0000000,NO,,0.6864350
RASFGATIENDPCIHAK,ph,S,1409,true,"Tissue atlas Arabidopsis - ProteomicsDB",114,32188942,"MaxQuant score",192.1900000,0.9999910,,,,9.1155446013254E-40,
RASFGATIENDPCIHAK,ph,S,1409,true,"Touch-induced phosphorylation: 40s touch vs untouc",136,30291188,"MASCOT score",72.5300000,,0.1930764,0.6534631,NO,,3.6571571
RASFGATIENDPCIHAK,ph,T,1413,true,"Tyrosine phosphorylation in Arabidopsis",59,18463617,"MASCOT Score",50.0000000,,,,,,-0.4578112
RASFGATIENDPCIHAK,ph,T,1413,true,"srk2dei ABA signaling phopshoproteomics",83,23572148,"MASCOT Score",59.0000000,,,,,,0.0008000
RASFGATIENDPCIHAK,ph,T,1413,true,"TOR Kinase and ABA Receptor",100,29290610,XCorr,3.9745088,0.9851000,,,,0.0031169999856502,
DKTLQSVESMSVR,ph,S,1442,true,"Tissue atlas Arabidopsis - ProteomicsDB",114,32188942,"MaxQuant score",228.4200000,0.9988530,,,,0,
TLQSVESMSVR,ph,S,1444,true,"Tissue atlas Arabidopsis - ProteomicsDB",114,32188942,"MaxQuant score",162.9300000,0.9172530,,,,7.1323898176434E-11,
