Peptide,PTM,ModifiedAA,ModifiedPosition,PeptideUniqueToGene,ExperimentDesc,ExpID,PubmedID,ScoreType,IdentScore,LocProb,Log2FChange,PQ-val,QuantSig,PEP,MassErrorPPM
ANAASGMAVHDDCKLKFMEL,nt,A,2,false,"Arg/N-end rule seed, prt6 vs. Wt",99,29168982,"MASCOT Score",31.3600000,,,,,0.0073230001144111,1.1322811
ANAASGMAVHDDCKLKFME,nt,A,2,false,"Stromal N-terminome",96,26371235,"MASCOT Score",63.7100000,,,,,,
ANAASGMAVHDDCKLK,nt,A,2,false,"Stromal N-terminome",96,26371235,"MASCOT Score",41.7000000,,,,,,
ANAASGMAVHDDCKL,nt,A,2,false,"Arg/N-end rule seed, prt6 vs. Wt",99,29168982,"MASCOT Score",73.1200000,,,,,0.00023330000112765,-1.9723088
ANAASGMAVHDD,nt,A,2,false,"Arg/N-end rule seed, prt6 vs. Wt",99,29168982,"MASCOT Score",47.2800000,,,,,0.0001849999971455,-1.6299211
ANAASGMAVHD,nt,A,2,false,"Arg/N-end rule seed, prt6 vs. Wt",99,29168982,"MASCOT Score",65.6300000,,,,,8.5769999714103E-5,-0.3660487
ANAASGMAVH,nt,A,2,false,"Arg/N-end rule seed, prt6 vs. Wt",99,29168982,"MASCOT Score",52.2500000,,,,,0.034719999879599,-0.3120260
ANAASGMAVHDDCKLKFMEL,nta,A,2,false,"Arg/N-end rule pathway Roots",80,25728785,"MASCOT Score",48.2400000,,,,,6.2989997786644E-6,
ANAASGMAVHDDCKLKFMEL,nta,A,2,false,"Arg/N-end rule seed, prt6 vs. Wt",99,29168982,"MASCOT Score",31.3600000,,-0.9499698,0.2426411,NO,0.0073230001144111,1.1322811
ANAASGMAVHDDCKLKFMEL,nta,A,2,false,"Arabidopsis translation initiation landscape - NTA",167a,35069635,,,,,,,,
ANAASGMAVHDDCKLKFME,nta,A,2,false,"Stromal N-terminome",96,26371235,"MASCOT Score",63.7100000,,,,,,
ANAASGMAVHDDCKLKF,nta,A,2,false,"Arg/N-end rule pathway Roots",80,25728785,"MASCOT Score",25.6600000,,,,,0.0072630001232028,
ANAASGMAVHDDCKLK,nta,A,2,false,"Arg/N-end rule pathway Roots",80,25728785,"MASCOT Score",70.7700000,,,,,1.423999947292E-6,
ANAASGMAVHDDCKLK,nta,A,2,false,"Stromal N-terminome",96,26371235,"MASCOT Score",41.7000000,,,,,,
ANAASGMAVHDDCKL,nta,A,2,false,"Arg/N-end rule seed, prt6 vs. Wt",99,29168982,"MASCOT Score",73.1200000,,0.1059806,0.2070318,NO,0.00023330000112765,-1.9723088
ANAASGMAVHDD,nta,A,2,false,"Arg/N-end rule seed, prt6 vs. Wt",99,29168982,"MASCOT Score",47.2800000,,,,,0.0001849999971455,-1.6299211
ANAASGMAVHD,nta,A,2,false,"Arg/N-end rule seed, prt6 vs. Wt",99,29168982,"MASCOT Score",65.6300000,,,,,8.5769999714103E-5,-0.3660487
ANAASGMAVH,nta,A,2,false,"Arg/N-end rule seed, prt6 vs. Wt",99,29168982,"MASCOT Score",52.2500000,,,,,0.034719999879599,-0.3120260
ANAASGMAVHDDCKLK,so,C,14,false,"S-sulfenylation site detection using YAP1C",110,32714340,,,,,,,,
AASGMAVHDDCK,so,C,14,false,"Arabidopsis S-sulfenylation chemoproteomics",108,31578252,"pFind PSM Score",0.0095238,,1.3897800,,,,-1.0797234
LKFMELK,ac,K,17,false,"Quantitative Acetylproteomics",101,29440448,,,,,,,,
FMELKAK,ac,K,22,true,"Quantitative Acetylproteomics",101,29440448,,,,,,,,
TIVYKIEDK,ac,K,33,true,"Quantitative Acetylproteomics",101,29440448,,,,,,,,
LGEPEQSYDDFAASLPADDCR,so,C,63,true,"S-sulfenylation site detection using YAP1C",110,32714340,,,,,,,,
YCIYDFDFVTAENCQK,sno,C,78,true,"hot5-4 / wildtype, FAT-switch S-nitrosoproteome",169,37277371,,,,0.2580846,0.0413239,NO,,
IFFIAWSPDTAKVR,ub,K,94,true,"upl3 mutant / wildtype",168,35926874,"MaxQuant score",101.5300000,1.0000000,-0.2670796,0.1185620,NO,6.2534900280298E-6,1.3104000
DKMIYASSKDR,nt,D,97,true,"Arabidopsis translation initiation landscape - NT",167b,35069635,,,,,,,,
DKMIYASSKDR,ub,K,105,true,"Arabidopsis ubiquitination COFRADIC",40,26744219,"MaxQuant Score",45.2800000,1.0000000,,,,0.0070000002160668,-0.7570000
ELDGIQVELQATDPTEMGLDVFKSR,ac,K,133,true,"Lysine acetylation gel-based Finkemeier et al",37,21311031,i-probability,0.9998150,,,,,,
