Peptide,PTM,ModifiedAA,ModifiedPosition,PeptideUniqueToGene,ExperimentDesc,ExpID,PubmedID,ScoreType,IdentScore,LocProb,Log2FChange,PQ-val,QuantSig,PEP,MassErrorPPM
HSSAANPSHSDLIDSFR,ph,S,29,true,"Tissue atlas Arabidopsis - ProteomicsDB",114,32188942,"MaxQuant score",231.8900000,0.9995820,,,,0,
HSSAANPSHSDLIDSFR,ph,S,31,true,"Tissue atlas Arabidopsis - ProteomicsDB",114,32188942,"MaxQuant score",192.1000000,0.9994540,,,,1.219330049643E-39,
HSSAANPSHSDLIDSFREPLDETLGHSYCYVPSSSNR,ph,S,36,true,"Tissue atlas Arabidopsis - ProteomicsDB",114,32188942,"MaxQuant score",248.7000000,0.9999700,,,,0,
EPLDETLGHSYCYVPSSSNR,ph,T,44,true,"Tissue atlas Arabidopsis - ProteomicsDB",114,32188942,"MaxQuant score",65.4380000,0.7714850,,,,0.00014160800492391,
EPLDETLGHSYCYVPSSSNR,ph,S,56,true,"Tissue atlas Arabidopsis - ProteomicsDB",114,32188942,"MaxQuant score",333.7500000,0.9484350,,,,0,
FISPFPSDR,ph,S,61,true,"atm and atr DNA damage response",88,25561503,"MASCOT Score",34.0000000,1.0000000,,,,,-0.5000000
FISPFPSDR,ph,S,61,true,"Tissue atlas Arabidopsis - ProteomicsDB",114,32188942,"MaxQuant score",128.1000000,1.0000000,,,,0.00012798000534531,
FISPFPSDR,ph,S,65,true,"Plasmamembrane phosphorylation",20,15308754,,,,,,,,
FISPFPSDR,ph,S,65,true,"atm and atr DNA damage response",88,25561503,"MASCOT Score",29.0000000,1.0000000,,,,,-0.1300000
FISPFPSDR,ph,S,65,true,"Tissue atlas Arabidopsis - ProteomicsDB",114,32188942,"MaxQuant score",132.3200000,1.0000000,,,,0.00011211699893465,
FVSPTASFR,ph,S,70,true,"Phosphorylation Early Elicitor Signaling",23,17317660,,,,,,,,
FVSPTASFR,ph,S,70,true,"Tissue atlas Arabidopsis - ProteomicsDB",114,32188942,"MaxQuant score",195.3600000,0.9999870,,,,2.8025969286496E-45,
FVSPTASFRLSPPHEPGR,ph,T,72,true,"Tissue atlas Arabidopsis - ProteomicsDB",114,32188942,"MaxQuant score",62.7220000,0.8423390,,,,0.0024802701082081,
FVSPTASFRLSPPHEPGR,ph,S,74,true,"Tissue atlas Arabidopsis - ProteomicsDB",114,32188942,"MaxQuant score",123.1400000,0.9787730,,,,6.559469899756E-14,
LSPPHEPGR,ph,S,78,true,"Phosphorylation Early Elicitor Signaling",23,17317660,,,,,,,,
LSPPHEPGR,ph,S,78,true,"Phytohormone-responsive phosphoproteins",34,20374526,"MASCOT Score",41.0000000,,,,,,9.2598900
LSPPHEPGR,ph,S,78,true,"atm and atr DNA damage response",88,25561503,"MASCOT Score",35.0000000,1.0000000,,,,,-0.1500000
LSPPHEPGR,ph,S,78,true,"Tissue atlas Arabidopsis - ProteomicsDB",114,32188942,"MaxQuant score",195.3600000,1.0000000,,,,2.8025969286496E-45,
IRGSGSSEQLHTGFR,ph,S,89,true,"Tissue atlas Arabidopsis - ProteomicsDB",114,32188942,"MaxQuant score",88.5480000,0.9732720,,,,3.2025898690335E-5,
GSGSSEQLHTGFR,ph,S,91,true,"atm and atr DNA damage response",88,25561503,"MASCOT Score",63.0000000,1.0000000,,,,,-0.0100000
GSGSSEQLHTGFR,ph,S,91,true,"Phospho cell culture sucrose/TOR",109,30833711,,,0.9924800,,,,,
GSGSSEQLHTGFR,ph,S,91,true,"Tissue atlas Arabidopsis - ProteomicsDB",114,32188942,"MaxQuant score",219.8400000,0.9959110,,,,0,
GSGSSEQLHTGFR,ph,S,92,true,"Tissue atlas Arabidopsis - ProteomicsDB",114,32188942,"MaxQuant score",77.1910000,0.8191740,,,,0.00033417099621147,
AISGASVSANTSNSK,ph,S,103,true,"Tissue atlas Arabidopsis - ProteomicsDB",114,32188942,"MaxQuant score",180.5600000,0.9999980,,,,4.9239001652949E-25,
AISGASVSANTSNSK,ph,S,108,true,"Tissue atlas Arabidopsis - ProteomicsDB",114,32188942,"MaxQuant score",141.5700000,0.9289220,,,,1.6057100538092E-7,
AISGASVSANTSNSK,ph,T,111,true,"Tissue atlas Arabidopsis - ProteomicsDB",114,32188942,"MaxQuant score",231.0600000,0.7818500,,,,0,
TVLQLEDIYDDATESSFGGGVR,ph,S,131,true,"Tissue atlas Arabidopsis - ProteomicsDB",114,32188942,"MaxQuant score",329.5200000,0.9362720,,,,0,
SGLFMSGPIER,ph,S,164,true,"Tissue atlas Arabidopsis - ProteomicsDB",114,32188942,"MaxQuant score",95.4010000,1.0000000,,,,0.00011704600183293,
SGLFMSGPIER,ph,S,169,true,"Plasmamembrane phosphorylation",20,15308754,,,,,,,,
SGLFMSGPIER,ph,S,169,true,"Tyrosine phosphorylation in Arabidopsis",59,18463617,"MASCOT Score",25.0000000,,,,,,-1.3358944
SGLFMSGPIER,ph,S,169,true,"atm and atr DNA damage response",88,25561503,"MASCOT Score",41.0000000,1.0000000,,,,,1.3400000
SGLFMSGPIER,ph,S,169,true,"Phospho cell culture sucrose/TOR",109,30833711,,,0.9999850,,,,,
SGLFMSGPIER,ph,S,169,true,"Tissue atlas Arabidopsis - ProteomicsDB",114,32188942,"MaxQuant score",135.8100000,1.0000000,,,,6.4011601352831E-7,
GATSGPLDPPAGEISR,ph,S,178,true,"Phosphorylation Early Elicitor Signaling",23,17317660,,,,,,,,
GATSGPLDPPAGEISR,ph,S,178,true,"Tyrosine phosphorylation in Arabidopsis",59,18463617,"MASCOT Score",37.0000000,,,,,,-1.1223887
GATSGPLDPPAGEISR,ph,S,178,true,"Phospho cell culture sucrose/TOR",109,30833711,,,0.7890240,,,,,
GATSGPLDPPAGEISR,ph,S,178,true,"Tissue atlas Arabidopsis - ProteomicsDB",114,32188942,"MaxQuant score",183.2100000,0.9516750,,,,1.1289399970198E-26,
GATSGPLDPPAGEISR,ph,S,189,true,"Plasmamembrane phosphorylation",20,15308754,,,,,,,,
GATSGPLDPPAGEISR,ph,S,189,true,"Tissue atlas Arabidopsis - ProteomicsDB",114,32188942,"MaxQuant score",183.2100000,1.0000000,,,,2.6620899433513E-28,
SNSAGVHFSAPLGGVYSK,ph,S,191,true,"Tyrosine phosphorylation in Arabidopsis",59,18463617,"MASCOT Score",25.0000000,,,,,,-0.2154191
SNSAGVHFSAPLGGVYSK,ph,S,191,true,"Tissue atlas Arabidopsis - ProteomicsDB",114,32188942,"MaxQuant score",210.6100000,0.9815290,,,,0,
SNSAGVHFSAPLGGVYSK,ph,S,193,true,"Phosphorylation Early Elicitor Signaling",23,17317660,,,,,,,,
SNSAGVHFSAPLGGVYSK,ph,S,193,true,"Tyrosine phosphorylation in Arabidopsis",59,18463617,"MASCOT Score",26.0000000,,,,,,-1.6695007
SNSAGVHFSAPLGGVYSK,ph,S,193,true,"TOR Kinase and ABA Receptor",100,29290610,XCorr,3.1799102,0.9828000,,,,0.00017159999697469,
SNSAGVHFSAPLGGVYSK,ph,S,193,true,"Phospho cell culture sucrose/TOR",109,30833711,,,0.9955040,,,,,
SNSAGVHFSAPLGGVYSK,ph,S,193,true,"Tissue atlas Arabidopsis - ProteomicsDB",114,32188942,"MaxQuant score",294.4000000,0.9997990,,,,0,
SNSAGVHFSAPLGGVYSK,ph,S,199,true,"Plasmamembrane phosphorylation",20,15308754,,,,,,,,
SNSAGVHFSAPLGGVYSK,ph,S,199,true,"Phosphorylation Early Elicitor Signaling",23,17317660,,,,,,,,
SNSAGVHFSAPLGGVYSK,ph,S,199,true,"Phospho cell culture sucrose/TOR",109,30833711,,,0.9993230,,,,,
SNSAGVHFSAPLGGVYSK,ph,S,199,true,"Tissue atlas Arabidopsis - ProteomicsDB",114,32188942,"MaxQuant score",231.2500000,1.0000000,,,,0,
SLSWHPIFGGEK,ph,S,217,true,"Tissue atlas Arabidopsis - ProteomicsDB",114,32188942,"MaxQuant score",176.5100000,0.9980230,,,,1.6691099745419E-15,
SLSWHPIFGGEK,ph,S,219,true,"Phospho cell culture sucrose/TOR",109,30833711,,,0.9996330,,,,,
SLSWHPIFGGEK,ph,S,219,true,"Tissue atlas Arabidopsis - ProteomicsDB",114,32188942,"MaxQuant score",167.0500000,0.9999940,,,,1.4351699353671E-14,
LTSSLEVVEVK,ph,S,374,true,"Tissue atlas Arabidopsis - ProteomicsDB",114,32188942,"MaxQuant score",142.7600000,0.9957870,,,,5.0200000600853E-8,
LTSSLEVVEVK,ph,S,375,true,"Tissue atlas Arabidopsis - ProteomicsDB",114,32188942,"MaxQuant score",119.4300000,0.9292260,,,,2.5082599677262E-5,
FAFSVDDAIGAGNAVSVGSKR,ph,S,426,true,"Tissue atlas Arabidopsis - ProteomicsDB",114,32188942,"MaxQuant score",241.2200000,0.9851110,,,,0,
KAGTVDHELVLK,ph,T,484,true,"Tissue atlas Arabidopsis - ProteomicsDB",114,32188942,"MaxQuant score",107.7000000,1.0000000,,,,1.9466400772217E-5,
