Peptide,PTM,ModifiedAA,ModifiedPosition,PeptideUniqueToGene,ExperimentDesc,ExpID,PubmedID,ScoreType,IdentScore,LocProb,Log2FChange,PQ-val,QuantSig,PEP,MassErrorPPM
CNSAVCSR,sno,C,87,false,"hot5-4 / wildtype, FAT-switch S-nitrosoproteome",169,37277371,,,,,,,,
IPNLIFSCGSTSLLK,ox,C,161,true,"OxiTRAQ SA and flg22 responses - SA vs mock",91a,25720653,"MASCOT Score",74.9500000,,1.0426443,0.0010000,YES,,
IPNLIFSCGSTSLLK,ox,C,161,true,"OxiTRAQ SA and flg22 responses - flg22 vs mock",91b,25720653,"MASCOT Score",74.9500000,,0.8155754,0.1130000,NO,,
FAVCLTSGR,ox,C,204,true,"Bicarbonate Induced Redox Changes - 5 min",117a,28184230,,,,-0.4739312,,YES,,
FAVCLTSGR,sno,C,204,true,"hot5-4 / wildtype, FAT-switch S-nitrosoproteome",169,37277371,,,,,,,,
INASTGIGGTK,ng,N,279,false,"Conserved N-glycosylation",74,22633491,"MaxQuant Score",97.5350000,1.0000000,,,,0.00027200000477023,-3.4510000
INASTGIGGTK,ng,N,279,false,"N-glycan occupancy Arabidopsis glycoproteins",87,23994444,"Ladder score",76.2000000,,,,,,
INASTGIGGTK,ng,N,279,false,"N-linked Glycan Micro-heterogeneity Arabidopsis",134,29237727,,,,,,,,
INASTGIGGTK,ng,N,279,false,"UDP-GlcNAc transporter glycopeptide analysis",135,30224661,,,,,,,5.2945356401324E-6,0.7000000
VASVKPFGACFSTK,ph,S,324,false,"Tissue atlas Arabidopsis - ProteomicsDB",114,32188942,"MaxQuant score",100.3900000,1.0000000,,,,3.3829601306934E-5,
VASVKPFGACFSTK,sno,C,331,false,"hot5-4 / wildtype, FAT-switch S-nitrosoproteome",169,37277371,,,,,,,,
QTNCANFNFTSTA,ng,N,429,false,"Conserved N-glycosylation",74,22633491,"MaxQuant Score",97.6150000,0.9720000,,,,9.6880001365207E-5,-0.6490000
